automated care
type: Class
comment: care initiated by a care actor and thereafter delivered by an automatic medical device
has metadata:
  namespace: directives.org.iso
  key: clauseType
  value: bodyAndTerm
has metadata:
  namespace: directives.org.iso
  key: example1
  value: Activities performed by the machine during a long-term Electrocardiography (“Holter recording”) programme, implanted cardiac defibrillator.
has metadata:
  namespace: directives.org.iso
  key: figureTitle
  value: Figure 55 — automated care (UML Representation)
has metadata:
  namespace: directives.org.iso
  key: note 1
  value: Automated care itself is not a care activity because a device cannot hold responsibility. The care actor who initiates and reviews automated care remains responsible for the safe use of the automatic medical device.
has metadata:
  namespace: directives.org.iso
  key: plural
  value: automated care
has metadata:
  namespace: directives.org.iso
  key: termClause
  value: 3.4.4
has metadata:
  namespace: directives.org.iso
  key: _profiled
  value: Yes
has metadata:
  namespace: uk.ac.ox.softeng.maurodatamapper.xmi
  key: isAbstract
  value: false
subclass of: care activity
subclass of: Restriction
  qualified cardinality: 1
  on class: care activity
subclass of: Restriction
  qualified cardinality: 1
  on class: care activity
subclass of: Restriction
  min qualified cardinality: 1
  on class: care activity