audit information
type: Concept
definition: documentation of the details of a revision of a base component
note: NOTE The audit information is a profile on ISO 27789:2013 Health informatics — Audit trails for electronic health records. The profile includes only the minimum set of attributes needed in EHR extracts.
related: base component
top concept of: contsys.org

hasPart
type: Property
comment: Expresses a partitive relationship between two concepts.
sub property of: narrower
inverse of: isPartOf

isPartOf
type: Property
comment: Expresses a partitive relationship between two concepts.
sub property of: broader
inverse of: hasPart