adverse event
type: Class
comment: unintended event that has negative impact upon a care process
has metadata:
  namespace: directives.org.iso
  key: clauseType
  value: bodyAndTerm
has metadata:
  namespace: directives.org.iso
  key: example1
  value: An infection acquired during a hospital stay.
has metadata:
  namespace: directives.org.iso
  key: example2
  value: A drug can be used as recommended but cause allergic reaction when the drug allergy was not known before the treatment.
has metadata:
  namespace: directives.org.iso
  key: example3
  value: An accident in connection to a care activity.
has metadata:
  namespace: directives.org.iso
  key: example4
  value: A mishap during correctly performed care activity.
has metadata:
  namespace: directives.org.iso
  key: figureTitle
  value: Figure 111 — adverse event (UML Representation)
has metadata:
  namespace: directives.org.iso
  key: note 1
  value: 'Iatrogenesis' or 'iatrogenic' is a common cause of adverse events.
has metadata:
  namespace: directives.org.iso
  key: note 2
  value: Adverse events can occur during appropriate care activities.
has metadata:
  namespace: directives.org.iso
  key: note 3
  value: Adverse events cause harm.
has metadata:
  namespace: directives.org.iso
  key: plural
  value: adverse events
has metadata:
  namespace: directives.org.iso
  key: termClause
  value: 3.7.13
has metadata:
  namespace: directives.org.iso
  key: _profiled
  value: Yes
has metadata:
  namespace: uk.ac.ox.softeng.maurodatamapper.xmi
  key: isAbstract
  value: false
subclass of: unintended event
subclass of: Restriction
  min qualified cardinality: 1
  on class: adverse event management
subclass of: Restriction
  min qualified cardinality: 1
  on class: care process